Reaction Details
TargetMelanin-concentrating hormone receptor 1
LigandBDBM50193679
Substrate/Competitorn/a
Meas. Tech.ChEMBL_421373 (CHEMBL856555)
IC50 2±n/a nM
Citation Jiang, JHoang, MYoung, JRChaung, DEid, RTurner, CLin, PTong, XWang, JTan, CFeighner, SPalyha, OHreniuk, DLPan, JSailer, AWMacNeil, DJHoward, AShearman, LStribling, SCamacho, RStrack, AVan der Ploeg, LHGoulet, MTDeVita, RJ 2-Aminoquinoline melanin-concentrating hormone (MCH)1R antagonists. Bioorg Med Chem Lett16:5270-4 (2006) 
 
Melanin-concentrating hormone receptor 1
Name:Melanin-concentrating hormone receptor 1
Type:G Protein-Coupled Receptor (GPCR)
Mol. Mass.:45976.27
Organism:Homo sapiens (Human)
Description:Membranes from CHO-K1 cells stably expressing human MCH1R were used in assays.
Residue:422
BDBM50193679
NameBDBM50193679
Synonyms:CHEMBL385748 | N-(2-(3-methylpyrrolidin-1-yl)quinolin-6-yl)-3-(4-(trifluoromethyl)phenyl)propanamide
TypeSmall organic molecule
Emp. Form.C24H24F3N3O
Mol. Mass.427.4621
SMILESCC1CCN(C1)c1ccc2cc(NC(=O)CCc3ccc(cc3)C(F)(F)F)ccc2n1