Reaction Details
TargetProto-oncogene tyrosine-protein kinase Src
LigandBDBM50193887
Substrate/Competitorn/a
Meas. Tech.ChEMBL_424208 (CHEMBL908982)
IC50 130±n/a nM
Citation Noronha, GBarrett, KCao, JDneprovskaia, EFine, RGong, XGritzen, CHood, JKang, XKlebansky, BLi, GLiao, WLohse, DMak, CCMcPherson, APalanki, MSPathak, VPRenick, JSoll, RSplittgerber, UWrasidlo, WZeng, BZhao, NZhou, Y Discovery and preliminary structure-activity relationship studies of novel benzotriazine based compounds as Src inhibitors. Bioorg Med Chem Lett16:5546-50 (2006) 
 
Proto-oncogene tyrosine-protein kinase Src
Name:Proto-oncogene tyrosine-protein kinase Src
Type:Protein
Mol. Mass.:59838.60
Organism:Homo sapiens (Human)
Description:P12931
Residue:536
BDBM50193887
NameBDBM50193887
Synonyms:7-(2,6-dimethylphenyl)-5,6-dimethyl-N-phenylbenzo[e][1,2,4]triazin-3-amine US8481536, 320
TypeSmall organic molecule
Emp. Form.C23H22N4
Mol. Mass.354.4476
SMILESCc1cccc(C)c1-c1cc2nnc(Nc3ccccc3)nc2c(C)c1C