Reaction Details
TargetProto-oncogene tyrosine-protein kinase Src
LigandBDBM50193897
Substrate/Competitorn/a
Meas. Tech.ChEMBL_424208 (CHEMBL908982)
IC50 21±n/a nM
Citation Noronha, GBarrett, KCao, JDneprovskaia, EFine, RGong, XGritzen, CHood, JKang, XKlebansky, BLi, GLiao, WLohse, DMak, CCMcPherson, APalanki, MSPathak, VPRenick, JSoll, RSplittgerber, UWrasidlo, WZeng, BZhao, NZhou, Y Discovery and preliminary structure-activity relationship studies of novel benzotriazine based compounds as Src inhibitors. Bioorg Med Chem Lett16:5546-50 (2006) 
 
Proto-oncogene tyrosine-protein kinase Src
Name:Proto-oncogene tyrosine-protein kinase Src
Type:Protein
Mol. Mass.:59838.60
Organism:Homo sapiens (Human)
Description:P12931
Residue:536
BDBM50193897
NameBDBM50193897
Synonyms:7-(2,6-dimethylphenyl)-N-(4-(2-ethoxy-4-methylpiperazin-1-yl)phenyl)-5-methylbenzo[e][1,2,4]triazin-3-amine | CHEMBL221236
TypeSmall organic molecule
Emp. Form.C29H34N6O
Mol. Mass.482.6199
SMILESCCOC1CN(C)CCN1c1ccc(Nc2nnc3cc(cc(C)c3n2)-c2c(C)cccc2C)cc1