Reaction Details
TargetProto-oncogene tyrosine-protein kinase Src
LigandBDBM50193901
Substrate/Competitorn/a
Meas. Tech.ChEMBL_424208 (CHEMBL908982)
IC50 480±n/a nM
Citation Noronha, GBarrett, KCao, JDneprovskaia, EFine, RGong, XGritzen, CHood, JKang, XKlebansky, BLi, GLiao, WLohse, DMak, CCMcPherson, APalanki, MSPathak, VPRenick, JSoll, RSplittgerber, UWrasidlo, WZeng, BZhao, NZhou, Y Discovery and preliminary structure-activity relationship studies of novel benzotriazine based compounds as Src inhibitors. Bioorg Med Chem Lett16:5546-50 (2006) 
 
Proto-oncogene tyrosine-protein kinase Src
Name:Proto-oncogene tyrosine-protein kinase Src
Type:Protein
Mol. Mass.:59838.60
Organism:Homo sapiens (Human)
Description:P12931
Residue:536
BDBM50193901
NameBDBM50193901
Synonyms:7-(2,6-dimethylphenyl)-5-methyl-N-(3-(piperazin-1-ylsulfonyl)phenyl)benzo[e][1,2,4]triazin-3-amine US8481536, 422
TypeSmall organic molecule
Emp. Form.C26H28N6O2S
Mol. Mass.488.605
SMILESCc1cccc(C)c1-c1cc(C)c2nc(Nc3cccc(c3)S(=O)(=O)N3CCNCC3)nnc2c1