Reaction Details
TargetProto-oncogene tyrosine-protein kinase Src
LigandBDBM50193912
Substrate/Competitorn/a
Meas. Tech.ChEMBL_424208 (CHEMBL908982)
IC50 12000±n/a nM
Citation Noronha, GBarrett, KCao, JDneprovskaia, EFine, RGong, XGritzen, CHood, JKang, XKlebansky, BLi, GLiao, WLohse, DMak, CCMcPherson, APalanki, MSPathak, VPRenick, JSoll, RSplittgerber, UWrasidlo, WZeng, BZhao, NZhou, Y Discovery and preliminary structure-activity relationship studies of novel benzotriazine based compounds as Src inhibitors. Bioorg Med Chem Lett16:5546-50 (2006) 
 
Proto-oncogene tyrosine-protein kinase Src
Name:Proto-oncogene tyrosine-protein kinase Src
Type:Protein
Mol. Mass.:59838.60
Organism:Homo sapiens (Human)
Description:P12931
Residue:536
BDBM50193912
NameBDBM50193912
Synonyms:7-(benzo[d][1,3]dioxol-5-yl)benzo[e][1,2,4]triazin-3-amine | CHEMBL384877
TypeSmall organic molecule
Emp. Form.C14H10N4O2
Mol. Mass.266.2548
SMILESNc1nnc2cc(ccc2n1)-c1ccc2OCOc2c1