Reaction Details
TargetEstrogen receptor
LigandBDBM50194080
Substrate/Competitorn/a
Meas. Tech.ChEMBL_402353 (CHEMBL866167)
IC50 22±n/a nM
Citation Kinzel, OFattori, DMuraglia, EGallinari, PNardi, MCPaolini, CRoscilli, GToniatti, CGonzalez Paz, OLaufer, RLahm, ATramontano, ACortese, RDe Francesco, RCiliberto, GKoch, U A structure-guided approach to an orthogonal estrogen-receptor-based gene switch activated by ligands suitable for in vivo studies. J Med Chem49:5404-7 (2006) 
 
Estrogen receptor
Name:Estrogen receptor
Type:Protein
Mol. Mass.:66230.44
Organism:Homo sapiens (Human)
Description:P03372
Residue:595
BDBM50194080
NameBDBM50194080
Synonyms:9a-(4-chlorobenzyl)-7-hydroxy-4-methyl-1,2,9,9a-tetrahydro-3H-fluoren-3-one | CHEMBL216024
TypeSmall organic molecule
Emp. Form.C21H19ClO2
Mol. Mass.338.827
SMILESCC1=C2c3ccc(O)cc3CC2(Cc2ccc(Cl)cc2)CCC1=O