Reaction Details
TargetEstrogen receptor
LigandBDBM50194084
Substrate/Competitorn/a
Meas. Tech.ChEMBL_402353 (CHEMBL866167)
IC50 29±n/a nM
Citation Kinzel, OFattori, DMuraglia, EGallinari, PNardi, MCPaolini, CRoscilli, GToniatti, CGonzalez Paz, OLaufer, RLahm, ATramontano, ACortese, RDe Francesco, RCiliberto, GKoch, U A structure-guided approach to an orthogonal estrogen-receptor-based gene switch activated by ligands suitable for in vivo studies. J Med Chem49:5404-7 (2006) 
 
Estrogen receptor
Name:Estrogen receptor
Type:Protein
Mol. Mass.:66230.44
Organism:Homo sapiens (Human)
Description:P03372
Residue:595
BDBM50194084
NameBDBM50194084
Synonyms:9a-benzyl-7-hydroxy-4-(4-hydroxyphenyl)-1,2,9,9a-tetrahydro-3H-fluoren-3-one | CHEMBL214972
TypeSmall organic molecule
Emp. Form.C26H22O3
Mol. Mass.382.4511
SMILESOc1ccc(cc1)C1=C2c3ccc(O)cc3CC2(Cc2ccccc2)CCC1=O