Reaction Details
TargetEstrogen receptor
LigandBDBM50194075
Substrate/Competitorn/a
Meas. Tech.ChEMBL_402353 (CHEMBL866167)
IC50 29±n/a nM
Citation Kinzel, OFattori, DMuraglia, EGallinari, PNardi, MCPaolini, CRoscilli, GToniatti, CGonzalez Paz, OLaufer, RLahm, ATramontano, ACortese, RDe Francesco, RCiliberto, GKoch, U A structure-guided approach to an orthogonal estrogen-receptor-based gene switch activated by ligands suitable for in vivo studies. J Med Chem49:5404-7 (2006) 
 
Estrogen receptor
Name:Estrogen receptor
Type:Protein
Mol. Mass.:66230.44
Organism:Homo sapiens (Human)
Description:P03372
Residue:595
BDBM50194075
NameBDBM50194075
Synonyms:9a-(4-chlorobenzyl)-7-hydroxy-4-[4-(2-piperidin-1-ylethoxy)phenyl]-1,2,9,9a-tetrahydro-3H-fluoren-3-one | CHEMBL209530
TypeSmall organic molecule
Emp. Form.C33H34ClNO3
Mol. Mass.528.081
SMILESOc1ccc2C3=C(C(=O)CCC3(Cc3ccc(Cl)cc3)Cc2c1)c1ccc(OCCN2CCCCC2)cc1