Reaction Details
TargetEstrogen receptor
LigandBDBM50194076
Substrate/Competitorn/a
Meas. Tech.ChEMBL_402353 (CHEMBL866167)
IC50 40±n/a nM
Citation Kinzel, OFattori, DMuraglia, EGallinari, PNardi, MCPaolini, CRoscilli, GToniatti, CGonzalez Paz, OLaufer, RLahm, ATramontano, ACortese, RDe Francesco, RCiliberto, GKoch, U A structure-guided approach to an orthogonal estrogen-receptor-based gene switch activated by ligands suitable for in vivo studies. J Med Chem49:5404-7 (2006) 
 
Estrogen receptor
Name:Estrogen receptor
Type:Protein
Mol. Mass.:66230.44
Organism:Homo sapiens (Human)
Description:P03372
Residue:595
BDBM50194076
NameBDBM50194076
Synonyms:2-[4-(9a-benzyl-7-hydroxy-3-oxo-2,3,9,9a-tetrahydro-1H-fluoren-4-yl)phenoxy]-N,N-dimethylethanamine | CHEMBL214207
TypeSmall organic molecule
Emp. Form.C30H31NO3
Mol. Mass.453.572
SMILESCN(C)CCOc1ccc(cc1)C1=C2c3ccc(O)cc3CC2(Cc2ccccc2)CCC1=O