Reaction Details
TargetEstrogen receptor
LigandBDBM50194087
Substrate/Competitorn/a
Meas. Tech.ChEMBL_402353 (CHEMBL866167)
IC50 22±n/a nM
Citation Kinzel, OFattori, DMuraglia, EGallinari, PNardi, MCPaolini, CRoscilli, GToniatti, CGonzalez Paz, OLaufer, RLahm, ATramontano, ACortese, RDe Francesco, RCiliberto, GKoch, U A structure-guided approach to an orthogonal estrogen-receptor-based gene switch activated by ligands suitable for in vivo studies. J Med Chem49:5404-7 (2006) 
 
Estrogen receptor
Name:Estrogen receptor
Type:Protein
Mol. Mass.:66230.44
Organism:Homo sapiens (Human)
Description:P03372
Residue:595
BDBM50194087
NameBDBM50194087
Synonyms:1-{2-[4-(9a-benzyl-7-hydroxy-3-oxo-2,3,9,9a-tetrahydro-1H-fluoren-4-yl)phenoxy]ethyl}piperidine | CHEMBL210063
TypeSmall organic molecule
Emp. Form.C33H35NO3
Mol. Mass.493.6359
SMILESOc1ccc2C3=C(C(=O)CCC3(Cc3ccccc3)Cc2c1)c1ccc(OCCN2CCCCC2)cc1