Reaction Details
TargetGlutamate receptor 1
LigandBDBM50194109
Substrate/Competitorn/a
Meas. Tech.ChEMBL_403340 (CHEMBL868050)
Ki 2300±n/a nM
Citation Andersen, TFTikhonov, DBBølcho, UBolshakov, KNelson, JKPluteanu, FMellor, IREgebjerg, JStrømgaard, K Uncompetitive antagonism of AMPA receptors: Mechanistic insights from studies of polyamine toxin derivatives. J Med Chem49:5414-23 (2006) 
 
Glutamate receptor 1
Name:Glutamate receptor 1
Type:Protein
Mol. Mass.:101583.91
Organism:Rattus norvegicus (Rat)
Description:P19490
Residue:907
BDBM50194109
NameBDBM50194109
Synonyms:(S)-N-(1-(5-(8-aminooctylamino)pentylamino)-3-(4-hydroxyphenyl)-1-oxopropan-2-yl)butyramide | CHEMBL212557
TypeSmall organic molecule
Emp. Form.C26H46N4O3
Mol. Mass.462.6684
SMILESCCCC(=O)N[C@@H](Cc1ccc(O)cc1)C(=O)NCCCCCNCCCCCCCCN