Reaction Details
TargetHistamine H2 receptor
LigandBDBM50194202
Substrate/Competitorn/a
Meas. Tech.ChEMBL_393879 (CHEMBL854649)
EC50>10000±n/a nM
Citation Watanabe, MKazuta, YHayashi, HYamada, SMatsuda, AShuto, S Stereochemical diversity-oriented conformational restriction strategy. Development of potent histamine H3 and/or H4 receptor antagonists with an imidazolylcyclopropane structure. J Med Chem49:5587-96 (2006) 
 
Histamine H2 receptor
Name:Histamine H2 receptor
Type:G Protein-Coupled Receptor (GPCR)
Mol. Mass.:40115.31
Organism:Homo sapiens (Human)
Description:n/a
Residue:359
BDBM50194202
NameBDBM50194202
Synonyms:(1S,2R)-trans-2-[2-(cyclohexylmethylamino)ethyl]-1-(1H-imidazol-4-yl)cyclopropane | CHEMBL214312
TypeSmall organic molecule
Emp. Form.C15H25N3
Mol. Mass.247.3791
SMILESC(C[C@H]1C[C@@H]1c1cnc[nH]1)NCC1CCCCC1