Reaction Details
TargetHistamine H3 receptor
LigandBDBM50194205
Substrate/Competitorn/a
Meas. Tech.ChEMBL_393880 (CHEMBL854650)
EC50>10000±n/a nM
Citation Watanabe, MKazuta, YHayashi, HYamada, SMatsuda, AShuto, S Stereochemical diversity-oriented conformational restriction strategy. Development of potent histamine H3 and/or H4 receptor antagonists with an imidazolylcyclopropane structure. J Med Chem49:5587-96 (2006) 
 
Histamine H3 receptor
Name:Histamine H3 receptor
Type:G Protein-Coupled Receptor (GPCR)
Mol. Mass.:48691.47
Organism:Homo sapiens (Human)
Description:Binding assays were using CHO cells stably expressing hH3R receptors.
Residue:445
BDBM50194205
NameBDBM50194205
Synonyms:(1R,2S)-trans-2-[2-(4-chlorobenzylamino)ethyl]-1-(1H-imidazol-4-yl)cyclopropane | CHEMBL213886
TypeSmall organic molecule
Emp. Form.C15H18ClN3
Mol. Mass.275.777
SMILESClc1ccc(CNCC[C@@H]2C[C@H]2c2cnc[nH]2)cc1