Reaction Details
TargetHistamine H3 receptor
LigandBDBM50194213
Substrate/Competitorn/a
Meas. Tech.ChEMBL_393873 (CHEMBL912689)
Ki>1000±n/a nM
Citation Watanabe, MKazuta, YHayashi, HYamada, SMatsuda, AShuto, S Stereochemical diversity-oriented conformational restriction strategy. Development of potent histamine H3 and/or H4 receptor antagonists with an imidazolylcyclopropane structure. J Med Chem49:5587-96 (2006) 
 
Histamine H3 receptor
Name:Histamine H3 receptor
Type:G Protein-Coupled Receptor (GPCR)
Mol. Mass.:48691.47
Organism:Homo sapiens (Human)
Description:Binding assays were using CHO cells stably expressing hH3R receptors.
Residue:445
BDBM50194213
NameBDBM50194213
Synonyms:(1R,2R)-cis-2-[2-(cyclohexylmethylamino)ethyl]-1-(1H-imidazol-4-yl)cyclopropane | CHEMBL213413
TypeSmall organic molecule
Emp. Form.C15H25N3
Mol. Mass.247.3791
SMILESC(C[C@H]1C[C@H]1c1cnc[nH]1)NCC1CCCCC1