Reaction Details
TargetDelta-type opioid receptor
LigandBDBM50194274
Substrate/Competitorn/a
Meas. Tech.ChEMBL_393086 (CHEMBL870438)
EC50 2.8±n/a nM
Citation Neumeyer, JLPeng, XKnapp, BIBidlack, JMLazarus, LHSalvadori, STrapella, CBalboni, G New opioid designed multiple ligand from Dmt-Tic and morphinan pharmacophores. J Med Chem49:5640-3 (2006) 
 
Delta-type opioid receptor
Name:Delta-type opioid receptor
Type:G Protein-Coupled Receptor (GPCR)
Mol. Mass.:40382.98
Organism:Homo sapiens (Human)
Description:Competition binding assays were carried out using membrane preparations from transfected HN9.10 cells that constitutively expressed the delta opioid receptor.
Residue:372
BDBM50194274
NameBDBM50194274
Synonyms:(-)-H-Dmt-Tic-beta-Ala-O-3-hydroxy-N-cyclobutylmethylmorphinan MCL-450
TypeSmall organic molecule
Emp. Form.C45H56N4O5
Mol. Mass.732.9499
SMILESCc1cc(O)cc(C)c1C[C@H](N)C(=O)N1Cc2ccccc2C[C@H]1C(=O)NCCC(=O)Oc1ccc2C[C@@H]3[C@@H]4CCCC[C@]4(CCN3CC3CCC3)c2c1