Reaction Details
TargetDelta-type opioid receptor
LigandBDBM50194488
Substrate/Competitorn/a
Meas. Tech.ChEMBL_424406 (CHEMBL911337)
IC50>10000±n/a nM
Citation Shiotani, KLi, TMiyazaki, ATsuda, YBryant, SDAmbo, ASasaki, YLazarus, LHOkada, Y Synthesis of 3,6-bis[H-Tyr/H-Dmt-NH(CH2)m,n]-2(1H)pyrazinone derivatives: function of alkyl chain length on opioid activity. Bioorg Med Chem Lett16:5793-6 (2006) 
 
Delta-type opioid receptor
Name:Delta-type opioid receptor
Type:Enzyme Catalytic Domain
Mol. Mass.:40577.25
Organism:MOUSE
Description:P32300
Residue:372
BDBM50194488
NameBDBM50194488
Synonyms:6-[4'-(H-Dmt)-aminobutyl]-3-[3'-(H-Dmt)-aminopropyl]-5-methyl-2(1H)-pyrazinone | CHEMBL385779
TypeSmall organic molecule
Emp. Form.C34H48N6O5
Mol. Mass.620.7821
SMILESCc1cc(O)cc(C)c1C[C@H](N)C(=O)NCCCCc1[nH]c(=O)c(CCCNC(=O)[C@@H](N)Cc2c(C)cc(O)cc2C)nc1C