Reaction Details
TargetPotassium voltage-gated channel subfamily H member 2
LigandBDBM50194566
Substrate/Competitorn/a
Meas. Tech.ChEMBL_424425 (CHEMBL910704)
Ki 880±n/a nM
Citation Elliott, JMCarling, RWChicchi, GGCrawforth, JHutson, PHJones, ABKelly, SMarwood, RMeneses-Lorente, GMezzogori, EMurray, FRigby, MRoyo, IRussell, MGShaw, DSohal, BTsao, KLWilliams, B N',2-diphenylquinoline-4-carbohydrazide based NK3 receptor antagonists II. Bioorg Med Chem Lett16:5752-6 (2006) 
 
Potassium voltage-gated channel subfamily H member 2
Name:Potassium voltage-gated channel subfamily H member 2
Type:Multi-pass membrane protein
Mol. Mass.:126672.65
Organism:Homo sapiens (Human)
Description:Q12809
Residue:1159
BDBM50194566
NameBDBM50194566
Synonyms:CHEMBL218639 | N'-[3-(4-isopropyl-piperazin-1-ylmethyl)-2-phenyl-quinoline-4-carbonyl]-N-phenyl-hydrazinecarboxylic acid methyl ester
TypeSmall organic molecule
Emp. Form.C32H35N5O3
Mol. Mass.537.652
SMILESCOC(=O)N(NC(=O)c1c(CN2CCN(CC2)C(C)C)c(nc2ccccc12)-c1ccccc1)c1ccccc1