Reaction Details
TargetMuscarinic acetylcholine receptor M5
LigandBDBM50194649
Substrate/Competitorn/a
Meas. Tech.ChEMBL_395702 (CHEMBL909210)
Ki 950±n/a nM
Citation Sagara, YSagara, TUchiyama, MOtsuki, SKimura, TFujikawa, TNoguchi, KOhtake, N Identification of a novel 4-aminomethylpiperidine class of M3 muscarinic receptor antagonists and structural insight into their M3 selectivity. J Med Chem49:5653-63 (2006) 
 
Muscarinic acetylcholine receptor M5
Name:Muscarinic acetylcholine receptor M5
Type:PROTEIN
Mol. Mass.:60102.35
Organism:Homo sapiens (Human)
Description:ChEMBL_1517990
Residue:532
BDBM50194649
NameBDBM50194649
Synonyms:(2R)-1-((2S,4R)-4-hydroxy-1-[3,3,3-tris(4-chlorophenyl)propanoyl]pyrrolidine-2-yl)carbonyl-N-(4-piperidinylethyl)pyrrolidine-2-carboxamide | CHEMBL378859
TypeSmall organic molecule
Emp. Form.C38H43Cl3N4O4
Mol. Mass.726.131
SMILESO[C@@H]1C[C@H](N(C1)C(=O)CC(c1ccc(Cl)cc1)(c1ccc(Cl)cc1)c1ccc(Cl)cc1)C(=O)N1CCC[C@@H]1C(=O)NCCC1CCNCC1