Reaction Details
TargetMuscarinic acetylcholine receptor M4
LigandBDBM50194643
Substrate/Competitorn/a
Meas. Tech.ChEMBL_395701 (CHEMBL909209)
Ki 120±n/a nM
Citation Sagara, YSagara, TUchiyama, MOtsuki, SKimura, TFujikawa, TNoguchi, KOhtake, N Identification of a novel 4-aminomethylpiperidine class of M3 muscarinic receptor antagonists and structural insight into their M3 selectivity. J Med Chem49:5653-63 (2006) 
 
Muscarinic acetylcholine receptor M4
Name:Muscarinic acetylcholine receptor M4
Type:Enzyme Catalytic Domain
Mol. Mass.:53079.31
Organism:Homo sapiens (Human)
Description:Cholinergic, muscarinic M4 CHRM4 HUMAN M3::P08173
Residue:479
BDBM50194643
NameBDBM50194643
Synonyms:(2R)-1-((2S,4R)-4-hydroxy-1-[3,3,3-tris(4-chlorophenyl)propanoyl]pyrrolidine-2-yl)carbonyl-N-((3R)-3-piperidinylmethyl)-pyrrolidine-2-carboxamide | CHEMBL215894
TypeSmall organic molecule
Emp. Form.C37H41Cl3N4O4
Mol. Mass.712.105
SMILESO[C@@H]1C[C@H](N(C1)C(=O)CC(c1ccc(Cl)cc1)(c1ccc(Cl)cc1)c1ccc(Cl)cc1)C(=O)N1CCC[C@@H]1C(=O)NC[C@@H]1CCCNC1