Reaction Details
TargetMuscarinic acetylcholine receptor M1
LigandBDBM50194657
Substrate/Competitorn/a
Meas. Tech.ChEMBL_395699 (CHEMBL909207)
Ki 580±n/a nM
Citation Sagara, YSagara, TUchiyama, MOtsuki, SKimura, TFujikawa, TNoguchi, KOhtake, N Identification of a novel 4-aminomethylpiperidine class of M3 muscarinic receptor antagonists and structural insight into their M3 selectivity. J Med Chem49:5653-63 (2006) 
 
Muscarinic acetylcholine receptor M1
Name:Muscarinic acetylcholine receptor M1
Type:Protein
Mol. Mass.:51442.54
Organism:Homo sapiens (Human)
Description:P11229
Residue:460
BDBM50194657
NameBDBM50194657
Synonyms:(2R)-N-(1-ethyl-4-piperidinylmethyl)-1-((2S,4R)-4-hydroxy-1-[3,3,3-tris(4-fluorophenyl)propanoyl]pyrrolidine-2-yl)carbonylpyrrolidine-2-carboxamide | CHEMBL213709
TypeSmall organic molecule
Emp. Form.C39H45F3N4O4
Mol. Mass.690.7942
SMILESCCN1CCC(CNC(=O)[C@H]2CCCN2C(=O)[C@@H]2C[C@@H](O)CN2C(=O)CC(c2ccc(F)cc2)(c2ccc(F)cc2)c2ccc(F)cc2)CC1