Reaction Details
Target5-hydroxytryptamine receptor 2A
LigandBDBM50194747
Substrate/Competitorn/a
Meas. Tech.ChEMBL_399258 (CHEMBL855891)
Ki 0.35±n/a nM
Citation McLean, THParrish, JCBraden, MRMarona-Lewicka, DGallardo-Godoy, ANichols, DE 1-Aminomethylbenzocycloalkanes: conformationally restricted hallucinogenic phenethylamine analogues as functionally selective 5-HT2A receptor agonists. J Med Chem49:5794-803 (2006) 
 
5-hydroxytryptamine receptor 2A
Name:5-hydroxytryptamine receptor 2A
Type:undefined
Mol. Mass.:52607.65
Organism:Homo sapiens (Human)
Description:P28223
Residue:471
BDBM50194747
NameBDBM50194747
Synonyms:((R)-4-bromo-3,6-dimethoxybenzocyclobuten-1-yl)methylamine | CHEMBL379637
TypeSmall organic molecule
Emp. Form.C11H14BrNO2
Mol. Mass.272.138
SMILESCOc1cc(Br)c(OC)c2C[C@@H](CN)c12