Reaction Details
TargetMitogen-activated protein kinase 9
LigandBDBM50194901
Substrate/Competitorn/a
Meas. Tech.ChEMBL_424575 (CHEMBL853926)
IC50 38±n/a nM
Citation Liu, GZhao, HLiu, BXin, ZLiu, MKosogof, CSzczepankiewicz, BGWang, SClampit, JEGum, RJHaasch, DLTrevillyan, JMSham, HL Aminopyridine carboxamides as c-Jun N-terminal kinase inhibitors: targeting the gatekeeper residue and beyond. Bioorg Med Chem Lett16:5723-30 (2006) 
 
Mitogen-activated protein kinase 9
Name:Mitogen-activated protein kinase 9
Type:Enzyme
Mol. Mass.:48131.49
Organism:Homo sapiens (Human)
Description:JNK-2 was purchased from Upstate Cell Signaling Solutions (formerly Upstate Biotechnology).
Residue:424
BDBM50194901
NameBDBM50194901
Synonyms:CHEMBL220504 | N-(4-(methylsulfonyl)benzyl)-4-amino-5-cyano-6-isopropoxypicolinamide
TypeSmall organic molecule
Emp. Form.C18H20N4O4S
Mol. Mass.388.441
SMILESCC(C)Oc1nc(cc(N)c1C#N)C(=O)NCc1ccc(cc1)S(C)(=O)=O