Reaction Details
TargetMitogen-activated protein kinase kinase kinase 8
LigandBDBM50194989
Substrate/Competitorn/a
Meas. Tech.ChEMBL_424645 (CHEMBL855706)
IC50>40000±n/a nM
Citation Hu, YGreen, NGavrin, LKJanz, KKaila, NLi, HQThomason, JRCuozzo, JWHall, JPHsu, SNickerson-Nutter, CTelliez, JBLin, LLTam, S Inhibition of Tpl2 kinase and TNFalpha production with quinoline-3-carbonitriles for the treatment of rheumatoid arthritis. Bioorg Med Chem Lett16:6067-72 (2006) 
 
Mitogen-activated protein kinase kinase kinase 8
Name:Mitogen-activated protein kinase kinase kinase 8
Type:Serine/threonine-protein kinase
Mol. Mass.:52916.89
Organism:Homo sapiens (Human)
Description:P41279
Residue:467
BDBM50194989
NameBDBM50194989
Synonyms:4-(3-chloro-4-fluorophenylamino)-6-(phenylamino)quinoline-3-carbonitrile | CHEMBL373557
TypeSmall organic molecule
Emp. Form.C22H14ClFN4
Mol. Mass.388.825
SMILESFc1ccc(Nc2c(cnc3ccc(Nc4ccccc4)cc23)C#N)cc1Cl