Reaction Details
TargetMitogen-activated protein kinase kinase kinase 8
LigandBDBM29896
Substrate/Competitorn/a
Meas. Tech.ChEMBL_424645 (CHEMBL855706)
IC50 1200±n/a nM
Citation Hu, YGreen, NGavrin, LKJanz, KKaila, NLi, HQThomason, JRCuozzo, JWHall, JPHsu, SNickerson-Nutter, CTelliez, JBLin, LLTam, S Inhibition of Tpl2 kinase and TNFalpha production with quinoline-3-carbonitriles for the treatment of rheumatoid arthritis. Bioorg Med Chem Lett16:6067-72 (2006) 
 
Mitogen-activated protein kinase kinase kinase 8
Name:Mitogen-activated protein kinase kinase kinase 8
Type:Serine/threonine-protein kinase
Mol. Mass.:52916.89
Organism:Homo sapiens (Human)
Description:P41279
Residue:467
BDBM29896
NameBDBM29896
Synonyms:1,7-naphthyridine-3-carbonitrile, 1 | CHEMBL197538
TypeSmall organic molecule
Emp. Form.C21H20ClFN6O
Mol. Mass.426.875
SMILESFc1ccc(Nc2c(cnc3cnc(NCCN4CCOCC4)cc23)C#N)cc1Cl