Reaction Details
TargetMitogen-activated protein kinase kinase kinase 8
LigandBDBM50195005
Substrate/Competitorn/a
Meas. Tech.ChEMBL_424645 (CHEMBL855706)
IC50 100±n/a nM
Citation Hu, YGreen, NGavrin, LKJanz, KKaila, NLi, HQThomason, JRCuozzo, JWHall, JPHsu, SNickerson-Nutter, CTelliez, JBLin, LLTam, S Inhibition of Tpl2 kinase and TNFalpha production with quinoline-3-carbonitriles for the treatment of rheumatoid arthritis. Bioorg Med Chem Lett16:6067-72 (2006) 
 
Mitogen-activated protein kinase kinase kinase 8
Name:Mitogen-activated protein kinase kinase kinase 8
Type:Serine/threonine-protein kinase
Mol. Mass.:52916.89
Organism:Homo sapiens (Human)
Description:P41279
Residue:467
BDBM50195005
NameBDBM50195005
Synonyms:6-(3-cyanobenzylamino)-4-(3-chloro-4-fluorophenylamino)quinoline-3-carbonitrile | CHEMBL221274
TypeSmall organic molecule
Emp. Form.C24H15ClFN5
Mol. Mass.427.861
SMILESFc1ccc(Nc2c(cnc3ccc(NCc4cccc(c4)C#N)cc23)C#N)cc1Cl