Reaction Details
TargetMitogen-activated protein kinase kinase kinase 8
LigandBDBM50195014
Substrate/Competitorn/a
Meas. Tech.ChEMBL_424645 (CHEMBL855706)
IC50 140±n/a nM
Citation Hu, YGreen, NGavrin, LKJanz, KKaila, NLi, HQThomason, JRCuozzo, JWHall, JPHsu, SNickerson-Nutter, CTelliez, JBLin, LLTam, S Inhibition of Tpl2 kinase and TNFalpha production with quinoline-3-carbonitriles for the treatment of rheumatoid arthritis. Bioorg Med Chem Lett16:6067-72 (2006) 
 
Mitogen-activated protein kinase kinase kinase 8
Name:Mitogen-activated protein kinase kinase kinase 8
Type:Serine/threonine-protein kinase
Mol. Mass.:52916.89
Organism:Homo sapiens (Human)
Description:P41279
Residue:467
BDBM50195014
NameBDBM50195014
Synonyms:6-(3-aminobenzylamino)-4-(3-chloro-4-fluorophenylamino)quinoline-3-carbonitrile | CHEMBL222954
TypeSmall organic molecule
Emp. Form.C23H17ClFN5
Mol. Mass.417.866
SMILESNc1cccc(CNc2ccc3ncc(C#N)c(Nc4ccc(F)c(Cl)c4)c3c2)c1