Reaction Details
TargetUDP-N-acetylenolpyruvoylglucosamine reductase
LigandBDBM50195549
Substrate/Competitorn/a
Meas. Tech.ChEMBL_414256 (CHEMBL908330)
IC50 8600±n/a nM
Citation Gilbert, AMFailli, AShumsky, JYang, YSeverin, ASingh, GHu, WKeeney, DPetersen, PJKatz, AH Pyrazolidine-3,5-diones and 5-hydroxy-1H-pyrazol-3(2H)-ones, inhibitors of UDP-N-acetylenolpyruvyl glucosamine reductase. J Med Chem49:6027-36 (2006) 
 
UDP-N-acetylenolpyruvoylglucosamine reductase
Name:UDP-N-acetylenolpyruvoylglucosamine reductase
Type:Protein
Mol. Mass.:37848.05
Organism:Escherichia coli K-12 (Enterobacteria)
Description:E. coli MurB
Residue:342
BDBM50195549
NameBDBM50195549
Synonyms:1,2-bis(3-chlorophenyl)-3,5-dioxopyrazolidine-4-carboxylic acid(4-chlorophenyl)amide | CHEMBL384978
TypeSmall organic molecule
Emp. Form.C22H14Cl3N3O3
Mol. Mass.474.724
SMILESOc1c(C(=O)Nc2ccc(Cl)cc2)c(=O)n(-c2cccc(Cl)c2)n1-c1cccc(Cl)c1