Reaction Details
TargetUDP-N-acetylenolpyruvoylglucosamine reductase
LigandBDBM50195577
Substrate/Competitorn/a
Meas. Tech.ChEMBL_414256 (CHEMBL908330)
IC50 6100±n/a nM
Citation Gilbert, AMFailli, AShumsky, JYang, YSeverin, ASingh, GHu, WKeeney, DPetersen, PJKatz, AH Pyrazolidine-3,5-diones and 5-hydroxy-1H-pyrazol-3(2H)-ones, inhibitors of UDP-N-acetylenolpyruvyl glucosamine reductase. J Med Chem49:6027-36 (2006) 
 
UDP-N-acetylenolpyruvoylglucosamine reductase
Name:UDP-N-acetylenolpyruvoylglucosamine reductase
Type:Protein
Mol. Mass.:37848.05
Organism:Escherichia coli K-12 (Enterobacteria)
Description:E. coli MurB
Residue:342
BDBM50195577
NameBDBM50195577
Synonyms:4-(biphenyl-4-carbonyl)-1,2-bis(4-chlorophenyl)-5-hydroxy-1,2-dihydropyrazol-3-one | CHEMBL217149
TypeSmall organic molecule
Emp. Form.C28H18Cl2N2O3
Mol. Mass.501.36
SMILESOc1c(C(=O)c2ccc(cc2)-c2ccccc2)c(=O)n(-c2ccc(Cl)cc2)n1-c1ccc(Cl)cc1