Reaction Details
TargetUDP-N-acetylenolpyruvoylglucosamine reductase
LigandBDBM50195578
Substrate/Competitorn/a
Meas. Tech.ChEMBL_414256 (CHEMBL908330)
IC50 25100±n/a nM
Citation Gilbert, AMFailli, AShumsky, JYang, YSeverin, ASingh, GHu, WKeeney, DPetersen, PJKatz, AH Pyrazolidine-3,5-diones and 5-hydroxy-1H-pyrazol-3(2H)-ones, inhibitors of UDP-N-acetylenolpyruvyl glucosamine reductase. J Med Chem49:6027-36 (2006) 
 
UDP-N-acetylenolpyruvoylglucosamine reductase
Name:UDP-N-acetylenolpyruvoylglucosamine reductase
Type:Protein
Mol. Mass.:37848.05
Organism:Escherichia coli K-12 (Enterobacteria)
Description:E. coli MurB
Residue:342
BDBM50195578
NameBDBM50195578
Synonyms:1,2-bis(3,4-dichlorophenyl)pyrazolidine-3,5-dione | CHEMBL425454
TypeSmall organic molecule
Emp. Form.C15H8Cl4N2O2
Mol. Mass.390.048
SMILESOc1cc(=O)n(-c2ccc(Cl)c(Cl)c2)n1-c1ccc(Cl)c(Cl)c1