Reaction Details
TargetCycloartenol-C-24-methyltransferase
LigandBDBM50195635
Substrate/Competitorn/a
Meas. Tech.ChEMBL_415082 (CHEMBL912396)
IC50>100000±n/a nM
Citation Gros, LLorente, SOJimenez, CJYardley, VRattray, LWharton, HLittle, SCroft, SLRuiz-Perez, LMGonzalez-Pacanowska, DGilbert, IH Evaluation of azasterols as anti-parasitics. J Med Chem49:6094-103 (2006) 
 
Cycloartenol-C-24-methyltransferase
Name:Cycloartenol-C-24-methyltransferase
Type:PROTEIN
Mol. Mass.:38266.01
Organism:Arabidopsis thaliana
Description:ChEMBL_415082
Residue:336
BDBM50195635
NameBDBM50195635
Synonyms:3beta-acetoxy-23,24-bisnor-chol-5-en-22-(methyl pentanoate) amine | CHEMBL218239
TypeSmall organic molecule
Emp. Form.C30H49NO4
Mol. Mass.487.7144
SMILESCOC(=O)CCCCNC[C@@H](C)[C@H]1CC[C@H]2C3CC=C4C[C@H](CC[C@]4(C)[C@H]3CC[C@]12C)OC(C)=O