Reaction Details
TargetCycloartenol-C-24-methyltransferase
LigandBDBM50195627
Substrate/Competitorn/a
Meas. Tech.ChEMBL_415082 (CHEMBL912396)
IC50 28±n/a nM
Citation Gros, LLorente, SOJimenez, CJYardley, VRattray, LWharton, HLittle, SCroft, SLRuiz-Perez, LMGonzalez-Pacanowska, DGilbert, IH Evaluation of azasterols as anti-parasitics. J Med Chem49:6094-103 (2006) 
 
Cycloartenol-C-24-methyltransferase
Name:Cycloartenol-C-24-methyltransferase
Type:PROTEIN
Mol. Mass.:38266.01
Organism:Arabidopsis thaliana
Description:ChEMBL_415082
Residue:336
BDBM50195627
NameBDBM50195627
Synonyms:22,26-azasterol | CHEMBL425634
TypeSmall organic molecule
Emp. Form.C26H45NO2
Mol. Mass.403.641
SMILESC[C@@](O)([C@H]1CC[C@H]2C3CC[C@H]4C[C@@H](O)CC[C@]4(C)[C@H]3CC[C@]12C)C1CCCCN1