Reaction Details
TargetBcl-2-like protein 1
LigandBDBM50196034
Substrate/Competitorn/a
Meas. Tech.ChEMBL_416890 (CHEMBL909446)
Ki 7±n/a nM
Citation Wang, GNikolovska-Coleska, ZYang, CYWang, RTang, GGuo, JShangary, SQiu, SGao, WYang, DMeagher, JStuckey, JKrajewski, KJiang, SRoller, PPAbaan, HOTomita, YWang, S Structure-based design of potent small-molecule inhibitors of anti-apoptotic Bcl-2 proteins. J Med Chem49:6139-42 (2006) 
 
Bcl-2-like protein 1
Name:Bcl-2-like protein 1
Type:Mitochondrion membrane; Single-pass membrane protein
Mol. Mass.:26039.60
Organism:Homo sapiens (Human)
Description:n/a
Residue:233
BDBM50196034
NameBDBM50196034
Synonyms:CHEMBL410802 | QEDIIRNIARHLAQVGDSMDR
TypeSmall organic molecule
Emp. Form.C100H169N35O34S
Mol. Mass.2437.691
SMILESCC[C@H](C)[C@H](NC(=O)[C@H](CC(N)=O)NC(=O)[C@H](CCCN=C(N)N)NC(=O)[C@@H](NC(=O)[C@@H](NC(=O)[C@H](CC(O)=O)NC(=O)[C@H](CCC(O)=O)NC(=O)[C@@H](N)CCC(N)=O)[C@@H](C)CC)[C@@H](C)CC)C(=O)N[C@@H](C)C(=O)N[C@@H](CCCN=C(N)N)C(=O)N[C@@H](Cc1cnc[nH]1)C(=O)N[C@@H](CC(C)C)C(=O)N[C@@H](C)C(=O)N[C@@H](CCC(N)=O)C(=O)N[C@@H](C(C)C)C(=O)NCC(=O)N[C@@H](CC(O)=O)C(=O)N[C@@H](CO)C(=O)N[C@@H](CCSC)C(=O)N[C@@H](CC(O)=O)C(=O)N[C@@H](CCCN=C(N)N)C(O)=O