Reaction Details
TargetThyrotropin-releasing hormone receptor
LigandBDBM50196445
Substrate/Competitorn/a
Meas. Tech.ChEMBL_431931 (CHEMBL917826)
Ki 400±n/a nM
Citation Kaur, NMonga, VLu, XGershengorn, MCJain, R Modifications of the pyroglutamic acid and histidine residues in thyrotropin-releasing hormone (TRH) yield analogs with selectivity for TRH receptor type 2 over type 1. Bioorg Med Chem15:433-43 (2006) 
 
Thyrotropin-releasing hormone receptor
Name:Thyrotropin-releasing hormone receptor
Type:PROTEIN
Mol. Mass.:45093.48
Organism:Homo sapiens (Human)
Description:ChEMBL_431933
Residue:398
BDBM50196445
NameBDBM50196445
Synonyms:(2S)-1-[(2S)-2-(2S)-6-oxohexahydro-2-pyridinylcarboxamido]-3-(2-propyl-1H-imidazolyl)propanoyl]azalone-2-carboxamide | CHEMBL224525
TypeSmall organic molecule
Emp. Form.C20H30N6O4
Mol. Mass.418.49
SMILESCCCc1ncc(C[C@H](NC(=O)[C@@H]2CCCC(=O)N2)C(=O)N2CCC[C@H]2C(N)=O)[nH]1