Reaction Details
TargetThyrotropin-releasing hormone receptor
LigandBDBM50196449
Substrate/Competitorn/a
Meas. Tech.ChEMBL_431931 (CHEMBL917826)
Ki 7500±n/a nM
Citation Kaur, NMonga, VLu, XGershengorn, MCJain, R Modifications of the pyroglutamic acid and histidine residues in thyrotropin-releasing hormone (TRH) yield analogs with selectivity for TRH receptor type 2 over type 1. Bioorg Med Chem15:433-43 (2006) 
 
Thyrotropin-releasing hormone receptor
Name:Thyrotropin-releasing hormone receptor
Type:PROTEIN
Mol. Mass.:45093.48
Organism:Homo sapiens (Human)
Description:ChEMBL_431933
Residue:398
BDBM50196449
NameBDBM50196449
Synonyms:(2S)-1-{(2S)-3-(1-allyl-1H-4-imidazolyl)-2-[(2S)-6-oxohexahydro-2-pyridinylcarboxamido]propropanoyl}azolane-2-carboxamide | CHEMBL388528
TypeSmall organic molecule
Emp. Form.C20H28N6O4
Mol. Mass.416.4741
SMILESNC(=O)[C@@H]1CCCN1C(=O)[C@H](Cc1cn(CC=C)cn1)NC(=O)[C@@H]1CCCC(=O)N1