Reaction Details
TargetAdenosine receptor A1
LigandBDBM50196542
Substrate/Competitorn/a
Meas. Tech.ChEMBL_440718 (CHEMBL889815)
Ki 8±n/a nM
Citation Elzein, EKalla, RLi, XPerry, TMarquart, TMicklatcher, MLi, YWu, YZeng, DZablocki, J N6-Cycloalkyl-2-substituted adenosine derivatives as selective, high affinity adenosine A1 receptor agonists. Bioorg Med Chem Lett17:161-6 (2006) 
 
Adenosine receptor A1
Name:Adenosine receptor A1
Type:G Protein-Coupled Receptor (GPCR)
Mol. Mass.:36520.92
Organism:Homo sapiens (Human)
Description:P30542
Residue:326
BDBM50196542
NameBDBM50196542
Synonyms:4-((1-(9-((2R,3R,4S,5R)-3,4-dihydroxy-5-(hydroxymethyl)-tetrahydrofuran-2-yl)-6-((R)-tetrahydrofuran-2-ylamino)-9H-purin-2-yl)-1H-pyrazole-4-carboxamido)methyl)benzoic acid | CHEMBL393496
TypeSmall organic molecule
Emp. Form.C26H28N8O8
Mol. Mass.580.5493
SMILESOC[C@H]1O[C@H]([C@H](O)[C@@H]1O)n1cnc2c(N[C@H]3CCCO3)nc(nc12)-n1cc(cn1)C(=O)NCc1ccc(cc1)C(O)=O