Reaction Details
TargetAdenosine receptor A1
LigandBDBM50196546
Substrate/Competitorn/a
Meas. Tech.ChEMBL_440718 (CHEMBL889815)
Ki 2±n/a nM
Citation Elzein, EKalla, RLi, XPerry, TMarquart, TMicklatcher, MLi, YWu, YZeng, DZablocki, J N6-Cycloalkyl-2-substituted adenosine derivatives as selective, high affinity adenosine A1 receptor agonists. Bioorg Med Chem Lett17:161-6 (2006) 
 
Adenosine receptor A1
Name:Adenosine receptor A1
Type:G Protein-Coupled Receptor (GPCR)
Mol. Mass.:36520.92
Organism:Homo sapiens (Human)
Description:P30542
Residue:326
BDBM50196546
NameBDBM50196546
Synonyms:1-(6-(cyclopentylamino)-9-((2R,3R,4S,5R)-3,4-dihydroxy-5-(hydroxymethyl)-tetrahydrofuran-2-yl)-9H-purin-2-yl)-N-methyl-1H-pyrazole-4-carboxamide | CHEMBL400034
TypeSmall organic molecule
Emp. Form.C20H26N8O5
Mol. Mass.458.471
SMILESCNC(=O)c1cnn(c1)-c1nc(NC2CCCC2)c2ncn([C@@H]3O[C@H](CO)[C@@H](O)[C@H]3O)c2n1