Reaction Details
TargetDisintegrin and metalloproteinase domain-containing protein 17
LigandBDBM50197234
Substrate/Competitorn/a
Meas. Tech.ChEMBL_440759 (CHEMBL889856)
IC50<1±n/a nM
Citation Condon, JSJoseph-McCarthy, DLevin, JILombart, HGLovering, FESun, LWang, WXu, WZhang, Y Identification of potent and selective TACE inhibitors via the S1 pocket. Bioorg Med Chem Lett17:34-9 (2006) 
 
Disintegrin and metalloproteinase domain-containing protein 17
Name:Disintegrin and metalloproteinase domain-containing protein 17
Type:Enzyme
Mol. Mass.:93007.89
Organism:Homo sapiens (Human)
Description:
Residue:824
BDBM50197234
NameBDBM50197234
Synonyms:4-((4-(but-2-ynyloxy)phenylsulfonyl)methyl)-1-(tert-butylsulfonyl)-N-hydroxypiperidine-4-carboxamide | CHEMBL233932
TypeSmall organic molecule
Emp. Form.C21H30N2O7S2
Mol. Mass.486.602
SMILESCC#CCOc1ccc(cc1)S(=O)(=O)CC1(CCN(CC1)S(=O)(=O)C(C)(C)C)C(=O)NO