Reaction Details
TargetDisintegrin and metalloproteinase domain-containing protein 17
LigandBDBM50197209
Substrate/Competitorn/a
Meas. Tech.ChEMBL_440768 (CHEMBL889865)
IC50 1.2±n/a nM
Citation Condon, JSJoseph-McCarthy, DLevin, JILombart, HGLovering, FESun, LWang, WXu, WZhang, Y Identification of potent and selective TACE inhibitors via the S1 pocket. Bioorg Med Chem Lett17:34-9 (2006) 
 
Disintegrin and metalloproteinase domain-containing protein 17
Name:Disintegrin and metalloproteinase domain-containing protein 17
Type:Enzyme
Mol. Mass.:93007.89
Organism:Homo sapiens (Human)
Description:
Residue:824
BDBM50197209
NameBDBM50197209
Synonyms:4-((4-(but-2-ynyloxy)phenylsulfonyl)methyl)-N-hydroxy-1-(piperidin-1-ylsulfonyl)piperidine-4-carboxamide | CHEMBL231667
TypeSmall organic molecule
Emp. Form.C22H31N3O7S2
Mol. Mass.513.627
SMILESCC#CCOc1ccc(cc1)S(=O)(=O)CC1(CCN(CC1)S(=O)(=O)N1CCCCC1)C(=O)NO