Reaction Details
TargetStromelysin-1
LigandBDBM26526
Substrate/Competitorn/a
Meas. Tech.ChEMBL_440762 (CHEMBL889859)
IC50 141±n/a nM
Citation Condon, JSJoseph-McCarthy, DLevin, JILombart, HGLovering, FESun, LWang, WXu, WZhang, Y Identification of potent and selective TACE inhibitors via the S1 pocket. Bioorg Med Chem Lett17:34-9 (2006) 
 
Stromelysin-1
Name:Stromelysin-1
Type:Enzyme
Mol. Mass.:53973.13
Organism:Homo sapiens (Human)
Description: P08254
Residue:477
BDBM26526
NameBDBM26526
Synonyms:(2R)-N-hydroxy-2-[(3S)-3-methyl-3-{4-[(2-methylquinolin-4-yl)methoxy]phenyl}-2-oxopyrrolidin-1-yl]propanamide CHEMBL148169 | IK682
TypeSmall organic molecule
Emp. Form.C25H27N3O4
Mol. Mass.433.4996
SMILESC[C@@H](N1CC[C@](C)(C1=O)c1ccc(OCc2cc(C)nc3ccccc23)cc1)C(=O)NO