Reaction Details
TargetDisintegrin and metalloproteinase domain-containing protein 17
LigandBDBM50197222
Substrate/Competitorn/a
Meas. Tech.ChEMBL_440768 (CHEMBL889865)
IC50 1.3±n/a nM
Citation Condon, JSJoseph-McCarthy, DLevin, JILombart, HGLovering, FESun, LWang, WXu, WZhang, Y Identification of potent and selective TACE inhibitors via the S1 pocket. Bioorg Med Chem Lett17:34-9 (2006) 
 
Disintegrin and metalloproteinase domain-containing protein 17
Name:Disintegrin and metalloproteinase domain-containing protein 17
Type:Enzyme
Mol. Mass.:93007.89
Organism:Homo sapiens (Human)
Description:
Residue:824
BDBM50197222
NameBDBM50197222
Synonyms:4-((4-(but-2-ynyloxy)phenylsulfonyl)methyl)-N-hydroxy-1-(pyridin-2-yl)piperidine-4-carboxamide | CHEMBL234353
TypeSmall organic molecule
Emp. Form.C22H25N3O5S
Mol. Mass.443.516
SMILESCC#CCOc1ccc(cc1)S(=O)(=O)CC1(CCN(CC1)c1ccccn1)C(=O)NO