Reaction Details
TargetDisintegrin and metalloproteinase domain-containing protein 17
LigandBDBM50187794
Substrate/Competitorn/a
Meas. Tech.ChEMBL_440768 (CHEMBL889865)
IC50 2.1±n/a nM
Citation Condon, JSJoseph-McCarthy, DLevin, JILombart, HGLovering, FESun, LWang, WXu, WZhang, Y Identification of potent and selective TACE inhibitors via the S1 pocket. Bioorg Med Chem Lett17:34-9 (2006) 
 
Disintegrin and metalloproteinase domain-containing protein 17
Name:Disintegrin and metalloproteinase domain-containing protein 17
Type:Enzyme
Mol. Mass.:93007.89
Organism:Homo sapiens (Human)
Description:
Residue:824
BDBM50187794
NameBDBM50187794
Synonyms:4-((4-(but-2-ynyloxy)phenylsulfonyl)methyl)-N-hydroxy-1-(pyridin-4-ylmethyl)piperidine-4-carboxamide | CHEMBL387079
TypeSmall organic molecule
Emp. Form.C23H27N3O5S
Mol. Mass.457.543
SMILESCC#CCOc1ccc(cc1)S(=O)(=O)CC1(CCN(Cc2ccncc2)CC1)C(=O)NO