Reaction Details
Target11-beta-hydroxysteroid dehydrogenase 1
LigandBDBM50197416
Substrate/Competitorn/a
Meas. Tech.ChEMBL_453209 (CHEMBL902363)
IC50 125±n/a nM
Citation Sorensen, BWinn, MRohde, JShuai, QWang, JFung, SMonzon, KChiou, WStolarik, DImade, HPan, LDeng, XChovan, LLongenecker, KJudge, RQin, WBrune, MCamp, HFrevert, EUJacobson, PLink, JT Adamantane sulfone and sulfonamide 11-beta-HSD1 Inhibitors. Bioorg Med Chem Lett17:527-32 (2007) 
 
11-beta-hydroxysteroid dehydrogenase 1
Name:11-beta-hydroxysteroid dehydrogenase 1
Type:Enzyme
Mol. Mass.:32409.16
Organism:Homo sapiens (Human)
Description:P28845
Residue:292
BDBM50197416
NameBDBM50197416
Synonyms:2-(2-chloro-4-fluoro-phenoxy)-2-methyl-N-(5-sulfamoyl-adamantan-2-yl)-propionamide | CHEMBL391652
TypeSmall organic molecule
Emp. Form.C20H26ClFN2O4S
Mol. Mass.444.948
SMILESCC(C)(Oc1ccc(F)cc1Cl)C(=O)N[C@H]1C2CC3CC1C[C@](C3)(C2)S(N)(=O)=O