Reaction Details
TargetSodium-dependent dopamine transporter
LigandBDBM50198225
Substrate/Competitorn/a
Meas. Tech.ChEMBL_453326 (CHEMBL901476)
Ki 716±n/a nM
Citation Tamagnan, GDBrenner, EAlagille, DStaley, JKHaile, CKoren, AEarly, MBaldwin, RMTarazi, FIBaldessarini, RJJarkas, NGoodman, MMSeibyl, JP Development of SPECT imaging agents for the norepinephrine transporters: [123I]INER. Bioorg Med Chem Lett17:533-7 (2007) 
 
Sodium-dependent dopamine transporter
Name:Sodium-dependent dopamine transporter
Type:Multi-pass membrane protein
Mol. Mass.:68749.45
Organism:Rattus norvegicus (rat)
Description:P23977
Residue:619
BDBM50198225
NameBDBM50198225
Synonyms:2-((2-methoxybenzyloxy)(3-iodophenyl)methyl)morpholine | CHEMBL245637
TypeSmall organic molecule
Emp. Form.C19H22INO3
Mol. Mass.439.2874
SMILESCOc1ccccc1COC(C1CNCCO1)c1cccc(I)c1