Reaction Details
TargetTyrosine-protein phosphatase non-receptor type 1
LigandBDBM50198348
Substrate/Competitorn/a
Meas. Tech.ChEMBL_432576 (CHEMBL918282)
Ki 57000±n/a nM
Citation Dixit, MTripathi, BKTamrakar, AKSrivastava, AKKumar, BGoel, A Synthesis of benzofuran scaffold-based potential PTP-1B inhibitors. Bioorg Med Chem15:727-34 (2006) 
 
Tyrosine-protein phosphatase non-receptor type 1
Name:Tyrosine-protein phosphatase non-receptor type 1
Type:Protein phosphatase
Mol. Mass.:49963.76
Organism:Homo sapiens (Human)
Description:Human recombinant GST-fusion PTP1B (1-435).
Residue:435
BDBM50198348
NameBDBM50198348
Synonyms:7-phenyl-furo[3,2-g]chromen-5-one | CHEMBL388814
TypeSmall organic molecule
Emp. Form.C17H10O3
Mol. Mass.262.2595
SMILESO=c1cc(oc2cc3occc3cc12)-c1ccccc1