Reaction Details
TargetCannabinoid receptor 1
LigandBDBM50198519
Substrate/Competitorn/a
Meas. Tech.ChEMBL_437693 (CHEMBL905968)
Ki 3.5±n/a nM
Citation Smith, RAFathi, ZBrown, SEChoi, SFan, JJenkins, SKluender, HCKonkar, ALavoie, RMays, RNatoli, JO'Connor, SJOrtiz, AAPodlogar, BTaing, CTomlinson, STritto, TZhang, Z Constrained analogs of CB-1 antagonists: 1,5,6,7-Tetrahydro-4H-pyrrolo[3,2-c]pyridine-4-one derivatives. Bioorg Med Chem Lett17:673-8 (2007) 
 
Cannabinoid receptor 1
Name:Cannabinoid receptor 1
Type:G Protein-Coupled Receptor (GPCR)
Mol. Mass.:52868.96
Organism:Homo sapiens (Human)
Description:P21554
Residue:472
BDBM50198519
NameBDBM50198519
Synonyms:1-(2-chlorophenyl)-2-(4-chlorophenyl)-3-methyl-5-(piperidin-1-yl)-6,7-dihydro-1H-pyrrolo[3,2-c]pyridin-4(5H)-one | CHEMBL231201
TypeSmall organic molecule
Emp. Form.C25H25Cl2N3O
Mol. Mass.454.392
SMILESCc1c2c(CCN(N3CCCCC3)C2=O)n(c1-c1ccc(Cl)cc1)-c1ccccc1Cl