Reaction Details
TargetCannabinoid receptor 1
LigandBDBM50198533
Substrate/Competitorn/a
Meas. Tech.ChEMBL_437693 (CHEMBL905968)
Ki 450±n/a nM
Citation Smith, RAFathi, ZBrown, SEChoi, SFan, JJenkins, SKluender, HCKonkar, ALavoie, RMays, RNatoli, JO'Connor, SJOrtiz, AAPodlogar, BTaing, CTomlinson, STritto, TZhang, Z Constrained analogs of CB-1 antagonists: 1,5,6,7-Tetrahydro-4H-pyrrolo[3,2-c]pyridine-4-one derivatives. Bioorg Med Chem Lett17:673-8 (2007) 
 
Cannabinoid receptor 1
Name:Cannabinoid receptor 1
Type:G Protein-Coupled Receptor (GPCR)
Mol. Mass.:52868.96
Organism:Homo sapiens (Human)
Description:P21554
Residue:472
BDBM50198533
NameBDBM50198533
Synonyms:2-(3-aminophenyl)-5-cyclohexyl-1-(2,4-dichlorophenyl)-3-methyl-6,7-dihydro-1H-pyrrolo[3,2-c]pyridin-4(5H)-one | CHEMBL230784
TypeSmall organic molecule
Emp. Form.C26H27Cl2N3O
Mol. Mass.468.418
SMILESCc1c2c(CCN(C3CCCCC3)C2=O)n(c1-c1cccc(N)c1)-c1ccc(Cl)cc1Cl