Reaction Details
TargetMelanin-concentrating hormone receptor 1
LigandBDBM50198582
Substrate/Competitorn/a
Meas. Tech.ChEMBL_421484 (CHEMBL854913)
Ki 32±n/a nM
Citation Meyers, KMMéndez-Andino, JLColson, AOWarshakoon, NCWos, JAMitchell, MCHodge, KMHoward, JMAckley, DCHolbert, JKMittelstadt, SWDowty, MEObringer, CMReizes, OHu, XE Aminomethyl tetrahydronaphthalene ketopiperazine MCH-R1 antagonists--Increasing selectivity over hERG. Bioorg Med Chem Lett17:819-22 (2007) 
 
Melanin-concentrating hormone receptor 1
Name:Melanin-concentrating hormone receptor 1
Type:G Protein-Coupled Receptor (GPCR)
Mol. Mass.:45976.27
Organism:Homo sapiens (Human)
Description:Membranes from CHO-K1 cells stably expressing human MCH1R were used in assays.
Residue:422
BDBM50198582
NameBDBM50198582
Synonyms:(S)-4-(2-cyclohexylethyl)-1-(6-((diethylamino)methyl)-1,2,3,4-tetrahydronaphthalen-2-yl)piperazin-2-one | CHEMBL384000
TypeSmall organic molecule
Emp. Form.C27H43N3O
Mol. Mass.425.6498
SMILESCCN(CC)Cc1ccc2C[C@H](CCc2c1)N1CCN(CCC2CCCCC2)CC1=O