Reaction Details
TargetMelanin-concentrating hormone receptor 1
LigandBDBM50198573
Substrate/Competitorn/a
Meas. Tech.ChEMBL_421485 (CHEMBL856547)
Ki 15±n/a nM
Citation Meyers, KMMéndez-Andino, JLColson, AOWarshakoon, NCWos, JAMitchell, MCHodge, KMHoward, JMAckley, DCHolbert, JKMittelstadt, SWDowty, MEObringer, CMReizes, OHu, XE Aminomethyl tetrahydronaphthalene ketopiperazine MCH-R1 antagonists--Increasing selectivity over hERG. Bioorg Med Chem Lett17:819-22 (2007) 
 
Melanin-concentrating hormone receptor 1
Name:Melanin-concentrating hormone receptor 1
Type:G Protein-Coupled Receptor (GPCR)
Mol. Mass.:45976.27
Organism:Homo sapiens (Human)
Description:Membranes from CHO-K1 cells stably expressing human MCH1R were used in assays.
Residue:422
BDBM50198573
NameBDBM50198573
Synonyms:(S)-1-(6-((diethylamino)methyl)-1,2,3,4-tetrahydronaphthalen-2-yl)-4-(4-fluorophenethyl)piperazin-2-one CHEMBL214629
TypeSmall organic molecule
Emp. Form.C27H36FN3O
Mol. Mass.437.5926
SMILESCCN(CC)Cc1ccc2C[C@H](CCc2c1)N1CCN(CCc2ccc(F)cc2)CC1=O