Reaction Details
TargetSphingosine 1-phosphate receptor 4
LigandBDBM50198834
Substrate/Competitorn/a
Meas. Tech.ChEMBL_432838 (CHEMBL914106)
EC50 2300±n/a nM
Citation Foss, FWSnyder, AHDavis, MDRouse, MOkusa, MDLynch, KRMacdonald, TL Synthesis and biological evaluation of gamma-aminophosphonates as potent, subtype-selective sphingosine 1-phosphate receptor agonists and antagonists. Bioorg Med Chem15:663-77 (2006) 
 
Sphingosine 1-phosphate receptor 4
Name:Sphingosine 1-phosphate receptor 4
Type:G Protein-Coupled Receptor (GPCR)
Mol. Mass.:41647.39
Organism:Homo sapiens (Human)
Description:n/a
Residue:384
BDBM50198834
NameBDBM50198834
Synonyms:CHEMBL227851 | [3-amino-3-(4-octylphenylcarbamoyl)propyl]-phosphonic acid
TypeSmall organic molecule
Emp. Form.C18H31N2O4P
Mol. Mass.370.4235
SMILESCCCCCCCCc1ccc(NC(=O)[C@H](N)CCP(O)(O)=O)cc1