Reaction Details
TargetSphingosine 1-phosphate receptor 2
LigandBDBM50198835
Substrate/Competitorn/a
Meas. Tech.ChEMBL_432836 (CHEMBL914104)
EC50 490±n/a nM
Citation Foss, FWSnyder, AHDavis, MDRouse, MOkusa, MDLynch, KRMacdonald, TL Synthesis and biological evaluation of gamma-aminophosphonates as potent, subtype-selective sphingosine 1-phosphate receptor agonists and antagonists. Bioorg Med Chem15:663-77 (2006) 
 
Sphingosine 1-phosphate receptor 2
Name:Sphingosine 1-phosphate receptor 2
Type:G Protein-Coupled Receptor (GPCR)
Mol. Mass.:38883.16
Organism:Homo sapiens (Human)
Description:Membranes isolated from S1P2-transfected CHO cells were used in ligand binding assay.
Residue:353
BDBM50198835
NameBDBM50198835
Synonyms:CHEMBL226612 | [3-amino-3-(4-decylphenylcarbamoyl)-2-fluoropropyl]-phosphonic acid
TypeSmall organic molecule
Emp. Form.C20H34FN2O5P
Mol. Mass.432.4665
SMILESCCCCCCCCCCc1ccc(NC(=O)[C@H](N)CC(F)OP(O)(O)=O)cc1